{"text_format":"1","workbook":"xlsx","n_sheets":4,"sheets":["cat","EH_ITP_Campus CU","EH_ITP_Campus Minería","EH_ITP_Campus UAT"],"not_rendered":{"charts":0,"images":2,"macros":0,"external_links":0,"defined_names":9,"comments":0,"pivot_tables":0},"unopened":[],"bounds":{"document_bytes":16777216,"sheet_cells":100000,"rows_first":2000,"rows_last":500,"rows_between":2000,"halvings":0,"cell_chars":16384,"cell_head_chars":4096},"cells_cut":0,"cells_raw":0,"read":"whole","date_system":"1900"}

{"sheet":"cat","index":0,"n_rows":284,"n_cols":2,"rows_kept":284,"cut":false,"hidden":true,"merged":[]}
["ÁREA UNIVERSITARIA","CÓDIGO"]
["Seleccione su Área Universitaria","Generado al seleccionar su Área Universitaria"]
["Auditoría Interna",741]
["Casa del Lago \"Maestro Juan José Arreola\"",616]
["Centro Cultural Universitario Tlatelolco",6112]
["Centro de Ciencias de la Complejidad",31124]
["Centro de Ciencias Genómicas en Cuernavaca, Morelos",3113]
["Centro de Ciencias Matemáticas en Morelia, Michoacán",31122]
["Centro de Enseñanza para Extranjeros",613]
["Centro de Estudios en Computación Avanzada",311109]
["Centro de Física Aplicada y Tecnología Avanzada en Juriquilla, Querétaro",31118]
["Centro de Geociencias en Juriquilla, Querétaro",3119]
["Centro de Investigaciones en Geografía Ambiental en Morelia, Michoacán",31121]
["Centro de Investigaciones Interdisciplinarias en Ciencias y Humanidades",2113]
["Centro de Investigaciones Multidisciplinarias sobre Chiapas y la Frontera Sur",21115]
["Centro de Investigaciones sobre América del Norte",2117]
["Centro de Investigaciones sobre América Latina y el Caribe",2115]
["Centro de Investigaciones y Estudios de Género",2119]
["Centro de Nanociencias y Nanotecnología en Ensenada, Baja California",3116]
["Centro Peninsular en Humanidades y Ciencias Sociales en Mérida, Yucatán",21112]
["Centro Regional de Investigaciones Multidisciplinarias de la UNAM en Cuernavaca, Morelos",2116]
["Centro Universitario de Teatro",615]
["Colegio de Administración de la UNAM","CC52"]
["Colegio de Directores de Bachillerato","CC5"]
["Colegio de Directores de Facultades y Escuelas","CC4"]
["Colegio de Responsables de Atención a la Comunidad Estudiantil de la Universidad Nacional Autónoma de México","CC510"]
["Comisión de Adquisición y Mantenimiento del Patrimonio Artístico de la UNAM","CC43"]
["Comisión de Propiedad Intelectual de la Universidad","CC32"]
["Comisión Universitaria de Vinculación Investigación-Docencia","CC30"]
["Comité Académico de Vinculación Externa en Informática de la Universidad Nacional Autónoma de México","CC25"]
["Comité Asesor de Obras de la UNAM","CC53"]
["Comité Asesor de Salud, Protección Civil y Manejo Ambiental de la UNAM","CC54"]
["Comité Asesor del Consejo del Sistema Bibliotecario","CC501"]
["Comité de Adquisiciones, Arrendamientos y Servicios de la Universidad Nacional Autónoma de México","CC51"]
["Comité de Análisis para las Intervenciones Urbanas, Arquitectónicas y de las Ingenierías en el Campus Ciudad Universitaria y los CAMPI de la Universidad Nacional Autónoma de México","CC504"]
["Comité de Catalogación del Patrimonio Cultural de la Universidad Nacional Autónoma de México","CC508"]
["Comité de Licitaciones del Patronato Universitario","CC506"]
["Comité de Preservación, Desarrollo y Mantenimiento del Patrimonio Inmobiliario de la UNAM","CC57"]
["Comité de Seguimiento establecido en los Lineamientos Generales para las Actividades Universitarias en el Marco de la Pandemia de COVID 19","CC511"]
["Comité de Sistemas Administrativos","CC50"]
["Comité de Transparencia de la Universidad Nacional Autónoma de México","CC12"]
["Comité de Vinculación Universitaria y de Transferencia","CC33"]
["Comité Técnico Asesor en Tecnología para la Prevención de Riesgos","CC503"]
["Comité Técnico de la Firma Electrónica Universitaria","CC507"]
["Comité Técnico de la Reserva Ecológica del Pedregal de San Ángel de Ciudad Universitaria","CC513"]
["Comité Técnico del Repositorio Institucional de la Universidad Nacional Autónoma de México","CC410"]
["Comité Técnico Institucional de Becas","CC210"]
["Comité Técnico Institucional de Becas Presupuestales de la UNAM","CC211"]
["Comité Técnico para la Atención de la Salud Mental de la Comunidad de la Universidad Nacional Autónoma de México","CC509"]
["Consejo Académico de Posgrado","CC6"]
["Consejo Académico del Área de las Ciencias Biológicas, Químicas y de la Salud","CC21"]
["Consejo Académico del Área de las Ciencias Físico Matemáticas y de las Ingenierías","CC20"]
["Consejo Académico del Área de las Ciencias Sociales","CC22"]
["Consejo Académico del Área de las Humanidades y de las Artes","CC23"]
["Consejo Académico del Bachillerato","CC7"]
["Consejo Asesor del Sistema Institucional de Tutorías","CC29"]
["Consejo Asesor del Sistema Universidad Abierta y Educación a Distancia","CC31"]
["Consejo Asesor en Tecnologías de Información y Comunicación de la Universidad Nacional Autónoma de México","CC58"]
["Consejo Consultivo de la Biblioteca y Hemeroteca Nacionales de México","CC47"]
["Consejo Consultivo de TV UNAM y Radio UNAM","CC46"]
["Consejo Consultivo Externo en Materia de Política de Inversiones del Patronato Universitario","CC56"]
["Consejo Consultivo para proponer acciones para fortalecer los derechos universitarios y la igualdad de género.","CC512"]
["Consejo de Cooperación e Internacionalización","CC26"]
["Consejo de Difusión Cultural","CC41"]
["Consejo de Evaluación Educativa de la Universidad Nacional Autónoma de México","CC27"]
["Consejo de Planeación y Seguimiento de la Universidad Nacional Autónoma de México","CC9"]
["Consejo de Publicaciones Académicas y Arbitradas","CC45"]
["Consejo de Radio UNAM","CC44"]
["Consejo del Sistema Bibliotecario ","CC59"]
["Consejo Editorial de la Universidad Nacional Autónoma de México","CC42"]
["Consejo General de toda la UNAM en Línea","CC28"]
["Consejo Técnico de Humanidades","211CC"]
["Consejo Técnico de la Investigación Científica","311CC"]
["Consejo Universitario","CC2"]
["Coordinación de Difusión Cultural",611]
["Coordinación de Humanidades",211]
["Coordinación de la Investigación Científica",311]
["Coordinación de Oficinas Jurídicas",7331]
["Coordinación de Planeación, Presupuestación y Evaluación",716]
["Coordinación de Plataformas Oceanográficas",31116]
["Coordinación de Proyectos Tecnológicos",711]
["Coordinación de Relaciones y Asuntos Internacionales",628]
["Coordinación de Servicios Administrativos en Juriquilla, Querétaro",527]
["Coordinación de Servicios Administrativos en Morelia, Michoacán",529]
["Coordinación de Servicios Administrativos, en Morelos",533]
["Coordinación de Servicios Administrativos, en Morelos",533]
["Coordinación de Vinculación con el Consejo Universitario",532]
["Coordinación de Vinculación y Transferencia Tecnológica",5269]
["Coordinación General de Estudios de Posgrado",513]
["Coordinación General de Planeación y Simplificación de la Gestión Institucional",712]
["Coordinación para la Igualdad de Género en la Universidad Nacional Autónoma de México",539]
["Coordinación Universitaria para la Sustentabilidad",5267]
["Defensoría de los Derechos Universitarios, Igualdad y Atención de la Violencia de Género",762]
["Dirección de Danza",626]
["Dirección de la Revista de la Universidad de México",657]
["Dirección de Literatura y Fomento a la Lectura",624]
["Dirección de Teatro",625]
["Dirección General de Actividades Cinematográficas",623]
["Dirección General de Administración Escolar",553]
["Dirección General de Análisis, Protección y Seguridad Universitaria",766]
["Dirección General de Artes Visuales",621]
["Dirección General de Asuntos del Personal Académico",523]
["Dirección General de Asuntos Jurídicos",732]
["Dirección General de Atención a la Comunidad",565]
["Dirección General de Atención a la Salud",563]
["Dirección General de Bibliotecas y Servicios Digitales de Información",564]
["Dirección General de Cómputo y de Tecnologías de Información y Comunicación",522]
["Dirección General de Comunicación Social",655]
["Dirección General de Control Presupuestal",743]
["Dirección General de Cooperación e Internacionalización de la UNAM",535]
["Dirección General de Divulgación de la Ciencia",641]
["Dirección General de Divulgación de las Humanidades",211112]
["Dirección General de Estudios de Legislación Universitaria",731]
["Dirección General de Evaluación Institucional",5264]
["Dirección General de Finanzas",744]
["Dirección General de Incorporación y Revalidación de Estudios",551]
["Dirección General de la Escuela Nacional Colegio de Ciencias y Humanidades",472]
["Dirección General de Música",622]
["Dirección General de Obras y Conservación",771]
["Dirección General de Orientación y Atención Educativa",552]
["Dirección General de Personal",723]
["Dirección General de Presupuesto",715]
["Dirección General de Proveeduría",724]
["Dirección General de Publicaciones y Fomento Editorial",652]
["Dirección General de Radio UNAM",656]
["Dirección General de Repositorios Universitarios",5268]
["Dirección General de Responsabilidades, Inconformidades, Quejas y Registro Patrimonial",746]
["Dirección General de Servicios Administrativos",764]
["Dirección General de Servicios Generales y Movilidad",763]
["Dirección General de Televisión Universitaria",653]
["Dirección General del Deporte Universitario",562]
["Dirección General del Patrimonio Universitario",742]
["Dirección General Escuela Nacional Preparatoria",451]
["Dirección General para la Prevención y Mejora de la Gestión Institucional",749]
["Escuela Nacional Colegio de Ciencias y Humanidades Plantel \"Azcapotzalco\"",4722]
["Escuela Nacional Colegio de Ciencias y Humanidades Plantel \"Naucalpan\"",4723]
["Escuela Nacional Colegio de Ciencias y Humanidades Plantel \"Oriente\"",4725]
["Escuela Nacional Colegio de Ciencias y Humanidades Plantel \"Sur\"",4726]
["Escuela Nacional Colegio de Ciencias y Humanidades Plantel \"Vallejo\"",4724]
["Escuela Nacional de Artes Cinematográficas",439]
["Escuela Nacional de Ciencias de la Tierra",438]
["Escuela Nacional de Enfermería y Obstetricia",434]
["Escuela Nacional de Estudios Superiores, Unidad Juriquilla, Querétaro",449]
["Escuela Nacional de Estudios Superiores, Unidad León, Guanajuato",446]
["Escuela Nacional de Estudios Superiores, Unidad Mérida, Yucatán",448]
["Escuela Nacional de Estudios Superiores, Unidad Morelia, Michoacán",447]
["Escuela Nacional de Lenguas, Lingüística y Traducción",437]
["Escuela Nacional de Trabajo Social",436]
["Escuela Nacional Preparatoria Plantel 1 \"Gabino Barreda\"",4521]
["Escuela Nacional Preparatoria Plantel 2 \"Erasmo Castellanos Quinto\"",4522]
["Escuela Nacional Preparatoria Plantel 3 \"Justo Sierra\"",4523]
["Escuela Nacional Preparatoria Plantel 4 \"Vidal Castañeda y Nájera\"",4524]
["Escuela Nacional Preparatoria Plantel 5 \"José Vasconcelos\"",4525]
["Escuela Nacional Preparatoria Plantel 6 \"Antonio Caso\"",4526]
["Escuela Nacional Preparatoria Plantel 7 \"Ezequiel A. Chávez\"",4527]
["Escuela Nacional Preparatoria Plantel 8 \"Miguel E. Schulz\"",4528]
["Escuela Nacional Preparatoria Plantel 9 \"Pedro de Alba\"",4529]
["Facultad de Arquitectura",424]
["Facultad de Artes y Diseño",425]
["Facultad de Ciencias",411]
["Facultad de Ciencias Políticas y Sociales",412]
["Facultad de Contaduría y Administración",413]
["Facultad de Derecho",414]
["Facultad de Economía",423]
["Facultad de Estudios Superiores Acatlán",442]
["Facultad de Estudios Superiores Aragón",444]
["Facultad de Estudios Superiores Cuautitlán",441]
["Facultad de Estudios Superiores Iztacala",443]
["Facultad de Estudios Superiores Zaragoza",445]
["Facultad de Filosofía y Letras",415]
["Facultad de Ingeniería",416]
["Facultad de Medicina",417]
["Facultad de Medicina Veterinaria y Zootecnia",419]
["Facultad de Música",426]
["Facultad de Odontología",421]
["Facultad de Psicología",422]
["Facultad de Química",418]
["Grupo Interdisciplinario de Archivos Universitarios","CC505"]
["Instituto de Astronomía",312]
["Instituto de Biología",313]
["Instituto de Biotecnología en Cuernavaca, Morelos",328]
["Instituto de Ciencias Aplicadas y Tecnología",336]
["Instituto de Ciencias de la Atmósfera y Cambio Climático",337]
["Instituto de Ciencias del Mar y Limnología",325]
["Instituto de Ciencias Físicas en Cuernavaca, Morelos",332]
["Instituto de Ciencias Nucleares",327]
["Instituto de Ecología",329]
["Instituto de Energías Renovables en Temixco, Morelos",333]
["Instituto de Física",314]
["Instituto de Fisiología Celular",326]
["Instituto de Geofísica",315]
["Instituto de Geografía",316]
["Instituto de Geología",317]
["Instituto de Ingeniería",323]
["Instituto de Investigaciones Antropológicas",221]
["Instituto de Investigaciones Bibliográficas",212]
["Instituto de Investigaciones Bibliotecológicas y de la Información",223]
["Instituto de Investigaciones Biomédicas",318]
["Instituto de Investigaciones Económicas",213]
["Instituto de Investigaciones en Ecosistemas y Sustentabilidad en Morelia, Michoacán",334]
["Instituto de Investigaciones en Matemáticas Aplicadas y en Sistemas",322]
["Instituto de Investigaciones en Materiales",324]
["Instituto de Investigaciones Estéticas",214]
["Instituto de Investigaciones Filológicas",219]
["Instituto de Investigaciones Filosóficas",215]
["Instituto de Investigaciones Históricas",216]
["Instituto de Investigaciones Jurídicas",217]
["Instituto de Investigaciones sobre la Universidad y la Educación",222]
["Instituto de Investigaciones Sociales",218]
["Instituto de Matemáticas",319]
["Instituto de Neurobiología en Querétaro, Querétaro",331]
["Instituto de Química",321]
["Instituto de Radioastronomía y Astrofísica en Morelia, Michoacán",335]
["Junta de Gobierno","CC1"]
["Museo Universitario del Chopo",617]
["Oficina de la Abogacía General",755]
["Oficina del Consejo Académico del Bachillerato",515]
["Oficina del Contralor",757]
["Oficina del Rector",751]
["Oficina del Tesorero",756]
["Patronato Universitario","CC3"]
["Presidencia Honoraria de la Biblioteca y Hemeroteca Nacionales de México","CC48"]
["Programa de Investigación en Cambio Climático",311112]
["Programa de Investigación y Formación Sociedad y Cultura. México Siglo XXI ",211102]
["Programa de Vinculación con los Egresados de la UNAM",5125]
["Programa Espacial Universitario",311114]
["Programa Universitario de Alimentación Sostenible",31117]
["Programa Universitario de Bioética",211110]
["Programa Universitario de Derechos Humanos",21113]
["Programa Universitario de Estudios de la Diversidad Cultural y la Interculturalidad",21111]
["Programa Universitario de Estudios del Desarrollo",21114]
["Programa Universitario de Estudios Interdisciplinarios del Suelo",311115]
["Programa Universitario de Estudios sobre Democracia, Justicia y Sociedad",211114]
["Programa Universitario de Estudios sobre Educación Superior",211113]
["Programa Universitario de Estudios sobre la Ciudad",2118]
["Programa Universitario de Gobierno","*"]
["Programa Universitario de Investigación sobre Riesgos Epidemiológicos y Emergentes",31119]
["Programa Universitario sobre Estudios de Asia y África",211111]
["Red de Educación Continua de la UNAM","CC24"]
["Red Universitaria para la Sustentabilidad","CC49"]
["Secretaría Administrativa",753]
["Secretaría de Desarrollo Institucional",758]
["Secretaría de Prevención, Atención y Seguridad Universitaria",759]
["Secretaría General",752]
["Seminario de Investigación en Juventud",52617]
["Seminario de Investigación Interdisciplinaria en Biomedicina",526112]
["Seminario de Investigación sobre Historia y Memoria Nacionales",52618]
["Seminario de Problemas Científicos y Filosóficos",52615]
["Seminario sobre Medicina y Salud",52616]
["Seminario Universitario de Culturas del Medio Oriente",526142]
["Seminario Universitario de Emprendimiento Social, Administración Sostenible y Formación Integral en los Niveles Medio Superior y Superior",526148]
["Seminario Universitario de Estudios de Riesgos Socioambientales",526144]
["Seminario Universitario de Estudios sobre Desplazamiento Interno, Migración, Exilio y Repatriación",526145]
["Seminario Universitario de Geopatrimonio y Geoparques",526147]
["Seminario Universitario de Gobernabilidad y Fiscalización",526134]
["Seminario Universitario de Historia, Filosofía, y Estudios de las Ciencias y la Medicina",526152]
["Seminario Universitario de Investigación del Patrimonio Cultural",526138]
["Seminario Universitario de Investigación en Creación Artística",526141]
["Seminario Universitario de la Modernidad: Versiones y Dimensiones",52614]
["Seminario Universitario de Sociedad, Medio Ambiente e Instituciones ",526143]
["Seminario Universitario de Transparencia",526132]
["Seminario Universitario Interdisciplinario de Estudios Rurales",526153]
["Seminario Universitario Interdisciplinario sobre Envejecimiento y Vejez",526113]
["Seminario Universitario Interdisciplinario sobre Racismo y Xenofobia ",526151]
["Seminario Universitario Interdisciplinario sobre Seguridad Ciudadana",526149]
["Seminario Universitario Interdisciplinario sobre Violencia Escolar",526133]
["Seminario Universitario sobre Afectividad y Emociones",526136]
["Seminario Universitario sobre el Estado Actual de las Ciencias y las Humanidades",526135]
["Seminario Universitario sobre Investigación en Hidrocarburos",526137]
["Torre de Vinculación y Gestión Universitaria Tlatelolco",672]
["Tribunal Universitario","CC11"]
["Unidad Académica de Ciencias y Tecnología de la UNAM en Yucatán",536]
["Unidad Coordinadora de Prevención, Atención y Seguridad Universitaria",554]
["Unidad Coordinadora de Servicios Académicos",512]
["Unidad Coordinadora de Servicios de Apoyo Administrativo a Junta de Gobierno y Consejos Académicos de Área",7522]
["Unidad Coordinadora de Servicios Institucionales",781]
["Unidad de Coordinación Administrativa",722]
["Unidad de Coordinación de la Contraloría",747]
["Unidad de Coordinación Institucional",725]
["Unidad de Coordinación Tesorería",745]
["Unidad de Seminarios \"Ignacio Chávez\"",661]
["Unidad de Transparencia de la Universidad Nacional Autónoma de México",726]
["Unidad para el Desarrollo de Planes y Programas",526]
["Unidad para el Fortalecimiento de la Docencia, la Investigación y la Extensión Universitaria",525]

{"sheet":"EH_ITP_Campus CU","index":1,"n_rows":32,"n_cols":14,"rows_kept":32,"cut":false,"hidden":false,"merged":[[32,0,40,13],[5,4,5,13],[6,4,6,13],[7,4,7,13],[30,11,30,13],[30,4,30,7],[30,9,30,10],[31,0,31,1],[31,3,31,4],[31,6,31,7],[1,0,1,13],[2,0,2,13],[12,0,15,0],[12,1,15,1],[12,2,15,2],[12,3,15,3],[12,4,15,4],[12,5,14,8],[12,9,14,10],[12,11,14,12],[12,13,15,13],[4,4,4,13]]}
[]
["INVENTARIO DE TRANSFERENCIA PRIMARIA"]
[2023]
[]
["FONDO:",null,null,null,"UNAM"]
["ÁREA UNIVERSITARIA:",null,null,null,"Facultad de Ingeniería"]
["CÓDIGO DEL ÁREA UNIVERSITARIA:",null,null,null,{"$f":"VLOOKUP(E6,cat!A2:B276,2,FALSE)","v":416}]
["ARCHIVO DE TRÁMITE DEL ÁREA PRODUCTORA:"]
["CLAVE DEL ÁREA PRODUCTORA:"]
["NÚMERO DE TRANSFERENCIA:"]
["FECHA DE TRANSFERENCIA:"]
[]
["NÚMERO DE CAJA","NÚMERO DEL EXPEDIENTE","CÓDIGO DE CLASIFICACIÓN","NOMBRE DEL EXPEDIENTE","DOCUMENTACIÓN","VALOR DOCUMENTAL",null,null,null,"FECHAS EXTREMAS",null,"PLAZOS DE CONSERVACIÓN",null,"OBSERVACIONES"]
[]
[]
[null,null,null,null,null,"A","L","F","C","APERTURA","CIERRE","AT","AC"]
["En cada caja sólo pueden ir expedientes de la misma serie o subserie y del mismo año","En esta columna se coloca el número que el expediente guarda dentro de la caja (el orden es de izquierda a derecha)","Se retoma el código con el que se reportó el expediente en el Inventario General","Se conserva el mismo nombre con el que se reportó en el Inventario General","Detalle de los documentos que integran el expediente",null,null,null,null,null,null,"Los plazos se retoman del catálogo 2023","Los plazos se retoman del catálogo 2023","Colocar el número total de fojas de cada expediente."]
[]
[]
[]
[]
[]
[]
[]
[]
[]
[]
[]
[]
[]
[null,"El presente inventario consta de",null,null,"páginas y ampara la cantidad de",null,null,null,{"$f":"COUNTA(C15:C29)","v":1},"expedientes de los años de"]
["contenidos en",null,null," cajas y un peso aproximado de",null,null,"kilogramos."]

{"sheet":"EH_ITP_Campus Minería","index":2,"n_rows":32,"n_cols":14,"rows_kept":32,"cut":false,"hidden":false,"merged":[[7,4,7,13],[1,0,1,13],[2,0,2,13],[4,4,4,13],[5,4,5,13],[6,4,6,13],[31,0,31,1],[31,3,31,4],[31,6,31,7],[32,0,40,13],[12,9,14,10],[12,11,14,12],[12,13,15,13],[30,4,30,7],[30,9,30,10],[30,11,30,13],[12,0,15,0],[12,1,15,1],[12,2,15,2],[12,3,15,3],[12,4,15,4],[12,5,14,8]]}
[]
["INVENTARIO DE TRANSFERENCIA PRIMARIA"]
[2023]
[]
["FONDO:",null,null,null,"UNAM"]
["ÁREA UNIVERSITARIA:",null,null,null,"Facultad de Ingeniería"]
["CÓDIGO DEL ÁREA UNIVERSITARIA:",null,null,null,{"$f":"VLOOKUP(E6,cat!A2:B276,2,FALSE)","v":416}]
["ARCHIVO DE TRÁMITE DEL ÁREA PRODUCTORA:"]
["CLAVE DEL ÁREA PRODUCTORA:"]
["NÚMERO DE TRANSFERENCIA:"]
["FECHA DE TRANSFERENCIA:"]
[]
["NÚMERO DE CAJA","NÚMERO DEL EXPEDIENTE","CÓDIGO DE CLASIFICACIÓN","NOMBRE DEL EXPEDIENTE","DOCUMENTACIÓN","VALOR DOCUMENTAL",null,null,null,"FECHAS EXTREMAS",null,"PLAZOS DE CONSERVACIÓN",null,"OBSERVACIONES"]
[]
[]
[null,null,null,null,null,"A","L","F","C","APERTURA","CIERRE","AT","AC"]
["En cada caja sólo pueden ir expedientes de la misma serie o subserie y del mismo año","En esta columna se coloca el número que el expediente guarda dentro de la caja (el orden es de izquierda a derecha)","Se retoma el código con el que se reportó el expediente en el Inventario General","Se conserva el mismo nombre con el que se reportó en el Inventario General","Detalle de los documentos que integran el expediente",null,null,null,null,null,null,"Los plazos se retoman del catálogo 2023","Los plazos se retoman del catálogo 2023","Anotar el total de fojas del expediente físico. A continuación, colocar la leyenda: \"UNA PARTE DE ESTE EXPEDIENTE SE ENCUENTRA EN FORMATO ELECTRÓNICO EN\"  y a continuación anotar la ubicación, ruta electrónica, sistema (especificando si es interno, de la Facultad o institucional, así como el área que está a cargo de este), tipo de almacenamiento en la nube, cuenta de correo electrónico, especificando la etiqueta o carpeta en la que se encuentra la información; si son documentos digitales en un equipo, disco duro externo o cualquier otro espacio de almacenamiento se deberá colocar el tamaño total de los archivos (en Megabytes, Gigabytes, etc.) y fecha de última modificación."]
[]
[]
[]
[]
[]
[]
[]
[]
[]
[]
[]
[]
[]
[null,"El presente inventario consta de",null,null,"páginas y ampara la cantidad de",null,null,null,{"$f":"COUNTA(C15:C29)","v":1},"expedientes de los años de"]
["contenidos en",null,null," cajas y un peso aproximado de",null,null,"kilogramos."]

{"sheet":"EH_ITP_Campus UAT","index":3,"n_rows":32,"n_cols":14,"rows_kept":32,"cut":false,"hidden":false,"merged":[[7,4,7,13],[1,0,1,13],[2,0,2,13],[4,4,4,13],[5,4,5,13],[6,4,6,13],[31,0,31,1],[31,3,31,4],[31,6,31,7],[32,0,40,13],[12,9,14,10],[12,11,14,12],[12,13,15,13],[30,4,30,7],[30,9,30,10],[30,11,30,13],[12,0,15,0],[12,1,15,1],[12,2,15,2],[12,3,15,3],[12,4,15,4],[12,5,14,8]]}
[]
["INVENTARIO DE TRANSFERENCIA PRIMARIA"]
[2023]
[]
["FONDO:",null,null,null,"UNAM"]
["ÁREA UNIVERSITARIA:",null,null,null,"Facultad de Ingeniería"]
["CÓDIGO DEL ÁREA UNIVERSITARIA:",null,null,null,{"$f":"VLOOKUP(E6,cat!A2:B276,2,FALSE)","v":416}]
["ARCHIVO DE TRÁMITE DEL ÁREA PRODUCTORA:"]
["CLAVE DEL ÁREA PRODUCTORA:"]
["NÚMERO DE TRANSFERENCIA:"]
["FECHA DE TRANSFERENCIA:"]
[]
["NÚMERO DE CAJA","NÚMERO DEL EXPEDIENTE","CÓDIGO DE CLASIFICACIÓN","NOMBRE DEL EXPEDIENTE","DOCUMENTACIÓN","VALOR DOCUMENTAL",null,null,null,"FECHAS EXTREMAS",null,"PLAZOS DE CONSERVACIÓN",null,"OBSERVACIONES"]
[]
[]
[null,null,null,null,null,"A","L","F","C","APERTURA","CIERRE","AT","AC"]
["En cada caja sólo pueden ir expedientes de la misma serie o subserie y del mismo año","En esta columna se coloca el número que el expediente guarda dentro de la caja (el orden es de izquierda a derecha)","Se retoma el código con el que se reportó el expediente en el Inventario General","Se conserva el mismo nombre con el que se reportó en el Inventario General","Detalle de los documentos que integran el expediente",null,null,null,null,null,null,"Los plazos se retoman del catálogo 2023","Los plazos se retoman del catálogo 2023","Anotar el total de fojas del expediente físico. A continuación, colocar la leyenda: \"UNA PARTE DE ESTE EXPEDIENTE SE ENCUENTRA EN FORMATO ELECTRÓNICO EN\"  y a continuación anotar la ubicación, ruta electrónica, sistema (especificando si es interno, de la Facultad o institucional, así como el área que está a cargo de este), tipo de almacenamiento en la nube, cuenta de correo electrónico, especificando la etiqueta o carpeta en la que se encuentra la información; si son documentos digitales en un equipo, disco duro externo o cualquier otro espacio de almacenamiento se deberá colocar el tamaño total de los archivos (en Megabytes, Gigabytes, etc.) y fecha de última modificación."]
[]
[]
[]
[]
[]
[]
[]
[]
[]
[]
[]
[]
[]
[null,"El presente inventario consta de",null,null,"páginas y ampara la cantidad de",null,null,null,{"$f":"COUNTA(C15:C29)","v":1},"expedientes de los años de"]
["contenidos en",null,null," cajas y un peso aproximado de",null,null,"kilogramos."]